{"text_format":"1","workbook":"xlsx","n_sheets":2,"sheets":["Blad1","Blad2"],"not_rendered":{"charts":0,"images":1,"macros":1,"external_links":0,"defined_names":2,"comments":0,"pivot_tables":0},"unopened":[],"bounds":{"document_bytes":16777216,"sheet_cells":100000,"rows_first":2000,"rows_last":500,"rows_between":2000,"halvings":0,"cell_chars":16384,"cell_head_chars":4096},"cells_cut":0,"cells_raw":0,"read":"whole","date_system":"1900"}

{"sheet":"Blad1","index":0,"n_rows":71,"n_cols":14,"rows_kept":71,"cut":false,"hidden":true,"merged":[]}
["Gemeente","Politiezone","Contactpersoon","Telefoonnummer","Email","contacpersoon 2","Telefoonnummer 2","email 2","Contacpersoon 3","Telefoonnummer 3","Email3 ","contacpersoon 4","telefoonnummer 4","email 4"]
["Antwerpen","PZ Antwerpen","Ronald (Ronny) Brys","\n03/338.19.25","Jeugd.spijbelen@politie.antwerpen.be","Paul Van Gelder (tvv Raf Van Bastelaer)","03/338.19.21",null,null,"03/338.19.19 (algemeen)"]
["Balen","PZ Balen/Dessel/ Mol","Nathalie Beelen","014/33.37.23",null,null,null,null,"algemeen",null,"celslazo@politiebalendesselmol.be"]
["Dessel","PZ Balen/Dessel/ Mol","Nathalie Beelen","014/33.37.23",null,null,null,null,"algemeen",null,"celslazo@politiebalendesselmol.be"]
["Mol","PZ Balen/Dessel/ Mol","Nathalie Beelen","014/33.37.23",null,null,null,null,"algemeen",null,"celslazo@politiebalendesselmol.be"]
["Berlaar","PZ Berlaar/Nijlen","Rutger Wils","03/466.16.21","pz.berlaarnijlen.jeugd@police.belgium.eu"]
["Nijlen","PZ Berlaar/Nijlen","Rutger Wils","03/466.16.21","pz.berlaarnijlen.jeugd@police.belgium.eu"]
["Bonheiden","PZ BODUKAP","Patrick Brawers","015/56.51.00","jeugd@politie-bodukap.be","Kim Rosier"]
["Duffel","PZ BODUKAP","Patrick Brawers","015/56.51.00","jeugd@politie-bodukap.be","Kim Rosier"]
["Putte","PZ BODUKAP","Patrick Brawers","015/56.51.00","jeugd@politie-bodukap.be","Kim Rosier"]
["Sint-Katelijne-Waver","PZ BODUKAP","Patrick Brawers","015/56.51.00","jeugd@politie-bodukap.be","Kim Rosier"]
["Brasschaat","PZ Brasschaat","Pascale Hansen ","03/650.35.65","Pz.brasschaat.jeugd@police.belgium.eu","Pascal Hanssen\n(jeugd en gezin)",null,"Pascale.hansen@police.belgium.eu"]
["Geel","PZ Geel/Laakdal/Meerhout","Bert Syen","014/56.47.85","Bert.syen@police.belgium.eu","Lotte Van Ranst","014/56.47.89","Lotte.vanranst@police.belgium.eu"]
["Laakdal","PZ Geel/Laakdal/Meerhout","Bert Syen","014/56.47.85","Bert.syen@police.belgium.eu","Lotte Van Ranst","014/56.47.89","Lotte.vanranst@police.belgium.eu"]
["Meerhout","PZ Geel/Laakdal/Meerhout","Bert Syen","014/56.47.85","Bert.syen@police.belgium.eu","Lotte Van Ranst","014/56.47.89","Lotte.vanranst@police.belgium.eu"]
["Essen","PZ Grens","Myriam Stuckens","\n0473/963.766","Ilse.robaye@pzgrens.be","Ilse Robaye","0492/91.52.82","myriam.stuckens@pzgrens.be","Tisha Jacobs","0474 88 71 30","tisha.jacobs@police.belgium.eu","algemeen","03/620.29.29 "]
["Kalmthout","PZ Grens","Myriam Stuckens","  \n0473/963.766","Ilse.robaye@pzgrens.be","Ilse Robaye","0492/91.52.82","myriam.stuckens@pzgrens.be","Tisha Jacobs","0474 88 71 30","tisha.jacobs@police.belgium.eu","algemeen","03/620.29.29 "]
["Wuustwezel","PZ Grens","Myriam Stuckens","      \n0473/963.766","Ilse.robaye@pzgrens.be","Ilse Robaye","0492/91.52.82","myriam.stuckens@pzgrens.be","Tisha Jacobs","0474 88 71 30","tisha.jacobs@police.belgium.eu","algemeen","03/620.29.29 "]
["Heist-op-den-Berg","PZ Heist","Yana Van Den Bergh ","015/75.09.33","yana.vandenbergh@police.belgium.eu",null,null,"jeugd@politieheist.be "]
["Aartselaar","PZ HEKLA","Tinne Van Rentergem ","03/444.00.80","tinne.van.rentergem@politiehekla.be","Linne Vanhaute",null,"line.vanhaute@politiehekla.be",null,null,"socialezaken@politiehekla.be "]
["Edegem","PZ HEKLA","Tinne Van Rentergem","03/444.00.80","tinne.van.rentergem@politiehekla.be","Linne Vanhaute",null,"line.vanhaute@politiehekla.be",null,null,"socialezaken@politiehekla.be "]
["Hove","PZ HEKLA","Tinne Van Rentergem ","03/444.00.80","tinne.van.rentergem@politiehekla.be","Linne Vanhaute",null,"line.vanhaute@politiehekla.be",null,null,"socialezaken@politiehekla.be "]
["Kontich","PZ HEKLA","Tinne Van Rentergem ","03/444.00.80","tinne.van.rentergem@politiehekla.be","Linne Vanhaute",null,"line.vanhaute@politiehekla.be",null,null,"socialezaken@politiehekla.be "]
["Lint","PZ HEKLA","Tinne Van Rentergem ","03/444.00.80","tinne.van.rentergem@politiehekla.be","Linne Vanhaute",null,"line.vanhaute@politiehekla.be",null,null,"socialezaken@politiehekla.be "]
["Arendonk","PZ Kempen Noord-Oost","Filip Stouten (Arendonk)","014/40.40.60","filip.stouten@police.belgium.eu","Marijke Verstraelen (Retie)",null,"marijke.verstraelen@police.belgium.eu","Wim Boulliard (Ravels)","willy.boulliard@police.belgium.eu",null,"wijkarendonk@pzkeno.be"]
["Ravels","PZ Kempen Noord-Oost","Filip Stouten (Arendonk)","014/40.40.60","filip.stouten@police.belgium.eu","Marijke Verstraelen (Retie)",null,"marijke.verstraelen@police.belgium.eu","Wim Boulliard (Ravels)","willy.boulliard@police.belgium.eu",null,"wijkarendonk@pzkeno.be"]
["Retie","PZ Kempen Noord-Oost","Filip Stouten (Arendonk)","014/40.40.60","filip.stouten@police.belgium.eu","Marijke Verstraelen (Retie)",null,"marijke.verstraelen@police.belgium.eu","Wim Boulliard (Ravels)","willy.boulliard@police.belgium.eu",null,"wijkarendonk@pzkeno.be"]
["Bornem","PZ Klein-Brabant","Pascale Luyten","03/293.22.25","Pascale.luyten@pz-klein-brabant.be"]
["Puurs","PZ Klein-Brabant","Pascale Luyten","03/293.22.25","Pascale.luyten@pz-klein-brabant.be"]
["Sint-Amands","PZ Klein-Brabant","Pascale Luyten","03/293.22.25","Pascale.luyten@pz-klein-brabant.be"]
["Lier","PZ Lier","Wim Vercauteren","03/491.44.24","Wim.vercauteren@police.belgium.eu"]
["Mechelen","PZ Mechelen/Willebroek","Peggy Bischop","015/46.41.20","Peggy.bischop@police.belgium.eu","Werner Van Hoeck"]
["Willebroek","PZ Mechelen/Willebroek","Peggy Bischop","015/46.41.20","Peggy.bischop@police.belgium.eu","Werner Van Hoeck"]
["Boechout","PZ MINOS","Algemeen (bij voorkeur)","03/451.98.72","team.personen@politieminos.be","Valerie Swennen (hoofdinspecteur BS)","\n03/451.98.72","valerie.swennen@politieminos.be\n"]
["Borsbeek","PZ MINOS","Algemeen (bij voorkeur)","03/451.98.72","team.personen@politieminos.be","Valerie Swennen (hoofdinspecteur BS)","\n03/451.98.72","valerie.swennen@politieminos.be\n"]
["Mortsel","PZ MINOS","Algemeen (bij voorkeur)","03/451.98.72","team.personen@politieminos.be","Valerie Swennen (hoofdinspecteur BS)","\n03/451.98.72","valerie.swennen@politieminos.be\n"]
["Wijnegem","PZ MINOS","Algemeen (bij voorkeur)","03/451.98.72","team.personen@politieminos.be","Valerie Swennen (hoofdinspecteur BS)","\n03/451.98.72","valerie.swennen@politieminos.be\n"]
["Wommelgem","PZ MINOS","Algemeen (bij voorkeur)","03/451.98.72","team.personen@politieminos.be","Valerie Swennen (hoofdinspecteur BS)","\n03/451.98.72","valerie.swennen@politieminos.be\n"]
["Grobbendonk","PZ Neteland","Pauwel Marij ","014/24.42.00","pz.neteland.jeugdgezin@police.belgium.eu","Erwin Nuyts",null,"Erwin.nuyts@police.belgium.eu"]
["Herentals","PZ Neteland","Pauwel Marij ","014/24.42.00","pz.neteland.jeugdgezin@police.belgium.eu","Erwin Nuyts",null,"Erwin.nuyts@police.belgium.eu"]
["Herenthout","PZ Neteland","Pauwel Marij ","014/24.42.00","pz.neteland.jeugdgezin@police.belgium.eu","Erwin Nuyts",null,"Erwin.nuyts@police.belgium.eu"]
["Olen","PZ Neteland","Pauwel Marij ","014/24.42.00","pz.neteland.jeugdgezin@police.belgium.eu","Erwin Nuyts",null,"Erwin.nuyts@police.belgium.eu"]
["Vorselaar","PZ Neteland","Pauwel Marij ","014/24.42.00","pz.neteland.jeugdgezin@police.belgium.eu","Erwin Nuyts",null,"Erwin.nuyts@police.belgium.eu"]
["Kapellen","PZ NOORD","Danny Van der Berckt","03/660.09.33","Daniel.vanderberckt@pznoord.be"]
["Stabroek","PZ NOORD","Danny Van der Berckt","03/660.09.33","Daniel.vanderberckt@pznoord.be"]
["Hoogstraten","PZ Noorderkempen","Geert Wouters","03/340.88.08","pz.noorderkempen.jeugdgezin@police.belgium.eu","Els Woestenborghs"]
["Merksplas","PZ Noorderkempen","Geert Wouters","03/340.88.08","pz.noorderkempen.jeugdgezin@police.belgium.eu","Els Woestenborghs"]
["Rijkevorsel","PZ Noorderkempen","Geert Wouters","03/340.88.08","pz.noorderkempen.jeugdgezin@police.belgium.eu","Els Woestenborghs"]
["Baarle-Hertog","PZ Regio Turnhout","Katia Verhoeven ","014/40.80.54","slachtofferzorg@turnhout.be","Johanna Loos"]
["Beerse","PZ Regio Turnhout","Katia Verhoeven ","014/40.80.54","slachtofferzorg@turnhout.be","Johanna Loos"]
["Kasterlee","PZ Regio Turnhout","Katia Verhoeven ","014/40.80.54","slachtofferzorg@turnhout.be","Johanna Loos"]
["Lille","PZ Regio Turnhout","Katia Verhoeven ","014/40.80.54","slachtofferzorg@turnhout.be","Johanna Loos"]
["Oud-Turnhout","PZ Regio Turnhout","Katia Verhoeven ","014/40.80.54","slachtofferzorg@turnhout.be","Johanna Loos"]
["Turnhout","PZ Regio Turnhout","Katia Verhoeven ","014/40.80.54","slachtofferzorg@turnhout.be","Johanna Loos"]
["Vosselaar","PZ Regio Turnhout","Katia Verhoeven ","014/40.80.54","slachtofferzorg@turnhout.be","Johanna Loos"]
["Boom","PZ RUPEL",null,"03/443.09.00","pz.rupel.wijk@police.belgium.eu","Fabienne Brusselmans"]
["Hemiksem","PZ RUPEL",null,"03/443.09.00","pz.rupel.wijk@police.belgium.eu","Fabienne Brusselmans"]
["Niel","PZ RUPEL",null,"03/443.09.00","pz.rupel.wijk@police.belgium.eu","Fabienne Brusselmans"]
["Rumst","PZ RUPEL",null,"03/443.09.00","pz.rupel.wijk@police.belgium.eu","Fabienne Brusselmans"]
["Schelle","PZ RUPEL",null,"03/443.09.00","pz.rupel.wijk@police.belgium.eu","Fabienne Brusselmans"]
["Schoten","PZ Schoten","Kim Verdijck","03/680.12.70","Kim.verdijck@police.belgium.eu",null,null,"pz.schoten.jeugdgezin@police.belgium.eu  "]
["Brecht","PZ Voorkempen","Lore Gysen","\n03/210.41.51 (rechtstr.)","lore.gysen@police.belgium.eu","Algemeen","03/210.40.00 ","pr.voorkempen.jeugdengezin@police.belgium.eu"]
["Malle","PZ Voorkempen","Lore Gysen","\n03/210.41.51 (rechtstr.)","lore.gysen@police.belgium.eu","Algemeen","03/210.40.00 ","pr.voorkempen.jeugdengezin@police.belgium.eu"]
["Schilde","PZ Voorkempen","Lore Gysen","\n03/210.41.51 (rechtstr.)","lore.gysen@police.belgium.eu","Algemeen","03/210.40.00 ","pr.voorkempen.jeugdengezin@police.belgium.eu"]
["Zoersel","PZ Voorkempen","Lore Gysen","\n03/210.41.51 (rechtstr.)","lore.gysen@police.belgium.eu","Algemeen","03/210.40.00 ","pr.voorkempen.jeugdengezin@police.belgium.eu"]
["Ranst","PZ ZARA","Peter Leysen Wijnants","03/485.65.11","pz.zara.jeugd@police.belgium.eu",null,null,"pz.zara.jeugd@police.belgium.eu"]
["Zandhoven","PZ ZARA","Peter Leysen Wijnants","03/485.65.11","pz.zara.jeugd@police.belgium.eu",null,null,"pz.zara.jeugd@police.belgium.eu"]
["Herselt","PZ Zuiderkempen","Ronny Van Lommel","014/53.96.00","Ronny.vanlommel@politiezuiderkempen.be","Sara Van Bael",null,"Sara.vanbael@politiezuiderkempen.be"]
["Hulshout","PZ Zuiderkempen","Ronny Van Lommel","014/53.96.00","Ronny.vanlommel@politiezuiderkempen.be","Sara Van Bael",null,"Sara.vanbael@politiezuiderkempen.be"]
["Westerlo","PZ Zuiderkempen","Ronny Van Lommel","014/53.96.00","Ronny.vanlommel@politiezuiderkempen.be","Sara Van Bael",null,"Sara.vanbael@politiezuiderkempen.be"]
["Zwijndrecht","PZ Zwijndrecht","Daphne Roelands","03 250 64 10","\ndaphne.roelands@politie.zwijndrecht.be\n",null,null,"info@politie.zwijndrecht.be"]

{"sheet":"Blad2","index":1,"n_rows":9,"n_cols":6,"rows_kept":9,"cut":false,"hidden":false,"merged":[]}
[]
[]
[]
[null,"Gemeente",""]
[]
[null,"Politiezone",{"$f":"VLOOKUP(C4,Blad1!1:1048576,2,FALSE)","v":{"$error":"#N/A"}}]
[null,"Contactpersoon",{"$f":"VLOOKUP(C4,Blad1!1:1048576,3,FALSE)","v":{"$error":"#N/A"}},{"$f":"VLOOKUP(C4,Blad1!1:1048576,6,FALSE)","v":{"$error":"#N/A"}},{"$f":"VLOOKUP(C4,Blad1!1:1048576,9,FALSE)","v":{"$error":"#N/A"}},{"$f":"VLOOKUP(C4,Blad1!1:1048576,12,FALSE)","v":{"$error":"#N/A"}}]
[null,"Telefoonnummer",{"$f":"VLOOKUP(C4,Blad1!1:1048576,4,FALSE)","v":{"$error":"#N/A"}},{"$f":"VLOOKUP(C4,Blad1!1:1048576,7,FALSE)","v":{"$error":"#N/A"}},{"$f":"VLOOKUP(C4,Blad1!1:1048576,10,FALSE)","v":{"$error":"#N/A"}},{"$f":"VLOOKUP(C4,Blad1!1:1048576,13,FALSE)","v":{"$error":"#N/A"}}]
[null,"Email",{"$f":"VLOOKUP(C4,Blad1!1:1048576,5,FALSE)","v":{"$error":"#N/A"}},{"$f":"VLOOKUP(C4,Blad1!1:1048576,8,FALSE)","v":{"$error":"#N/A"}},{"$f":"VLOOKUP(C4,Blad1!1:1048576,11,FALSE)","v":{"$error":"#N/A"}},{"$f":"VLOOKUP(C4,Blad1!1:1048576,14,FALSE)","v":{"$error":"#N/A"}}]